{"text_format":"1","workbook":"xlsx","n_sheets":10,"sheets":["Dashboard","Budget","Edit Vineyard","Edit Block","Add Block","Lists","Crop Co-efficient","Monthly rain","Monthly Et Short crop","Main Menu"],"not_rendered":{"charts":1,"images":2,"macros":1,"external_links":0,"defined_names":5,"comments":5,"pivot_tables":0},"unopened":[],"bounds":{"document_bytes":16777216,"sheet_cells":100000,"rows_first":2000,"rows_last":500,"rows_between":2000,"halvings":0,"cell_chars":16384,"cell_head_chars":4096},"cells_cut":0,"cells_raw":0,"read":"whole","date_system":"1900"}

{"sheet":"Dashboard","index":0,"n_rows":20,"n_cols":26,"rows_kept":20,"cut":false,"hidden":false,"merged":[[8,9,8,10],[9,9,9,10],[6,9,6,10],[6,11,6,12],[20,1,20,2],[16,1,16,2],[12,1,12,2],[12,3,12,4],[13,3,13,4],[14,3,14,4],[2,14,3,18],[2,1,5,5],[7,1,8,1],[13,1,13,2],[14,1,14,2],[11,17,14,17],[11,18,14,18],[9,11,9,12],[7,11,7,12],[8,11,8,12],[10,1,10,2],[2,7,4,12],[7,5,9,5],[7,6,9,6],[7,7,9,7],[7,9,7,10]]}
[null,null,null,null,null,null,null,null,null,null,null,null,null,null,null,null,null,null,null,null,null,null,null,null,null,3]
[null,null,null,null,null,null,null,null,null,null,null,null,null,null,null,null,null,null,null,null,null,null,null,null,null,3]
[null,null,null,null,null,null,null,"Vineyard Irrigation Budgeting Tool",null,null,null,null,null,null,"Operations"]
[]
[]
[]
[null,null,null,null,null,"Allocated","Unallocated",null,null,"Season:",null,{"$f":"Budget!C4","v":"2020-21"}]
[null,"Display Units:","mm",null,null,{"$f":"Budget!$H$25","v":10.74714182378808},{"$f":"Budget!$H$26","v":49.252858176211916},null,null,"Property Name:",null,{"$f":"Budget!C5","v":"AWRI Vineyard"}]
[null,null,"ML/ha",null,null,null,null,null,null,"Location:",null,{"$f":"Budget!C6","v":"Riverland"}]
[]
[null,"Disclaimer / Copyright"]
[null,null,null,null,null,"Jul","Aug","Sep","Oct","Nov","Dec","Jan","Feb","Mar","Apr","May","Jun"]
[null,null,null,"LTA Rainfall (mm):",null,{"$f":"Budget!I14","v":24.148387096774229},{"$f":"Budget!J14","v":23.661290322580655},{"$f":"Budget!K14","v":28.41612903225808},{"$f":"Budget!L14","v":21.712903225806446},{"$f":"Budget!M14","v":23.538709677419323},{"$f":"Budget!N14","v":23.887096774193548},{"$f":"Budget!O14","v":19.340624999999999},{"$f":"Budget!P14","v":19.471731843575427},{"$f":"Budget!Q14","v":12.177419354838703},{"$f":"Budget!R14","v":17.964516129032255},{"$f":"Budget!S14","v":21.716129032258063},{"$f":"Budget!T14","v":24.16451612903229}]
[null,null,null,"Expected Rainfall (mm):",null,35,33,9,77,44,55,66,4,22,null,null,99]
[null,null,null,"Actual Rainfall (mm):",null,20,17,2,55,6,9,68,65,7,33,7,7]
{"$rows_left_out":6}
{"sheet":"Budget","index":1,"n_rows":28,"n_cols":49,"rows_kept":28,"cut":false,"hidden":true,"merged":[[10,10,10,11],[18,8,18,19],[3,10,3,11],[4,10,4,11],[6,10,6,11],[7,18,7,19],[8,18,8,19],[8,10,8,11],[5,18,5,19],[6,18,6,19],[9,10,9,11],[3,18,3,19],[5,10,5,11],[10,18,10,19],[3,2,3,3],[6,2,6,3],[7,2,7,3],[8,2,8,3],[4,2,4,3],[5,2,5,3]]}
[]
[null,"Vineyard Irrigation Budgeting Tool"]
[]
[null,"Season:","2020-21",null,null,null,null,null,null,"Water available at start of season (ML):",50,null,null,null,null,null,null,"Irrigation application efficiency:",0.8]
[null,"Property Name:","AWRI Vineyard",null,null,null,null,null,null,"Additional water purchases or dam inflows (ML):",10]
[null,"Geographical Indication:","Riverland",null,null,null,null,null,null,"Total water available (ML):",{"$f":"K4+K5","v":60},null,null,null,null,null,null,"Soil Type:","Loamy sand"]
[null,"Station Name:",{"$f":"VLOOKUP(C6,Lists!A24:E92,2,FALSE)","v":"LOXTON RESEARCH CENTRE"},null,null,null,null,null,null,"Normal irrigation use (ML):",75,null,null,null,null,null,null,"Rooting Depth (m):",1.21]
[null,"Latitude:",{"$f":"VLOOKUP(C6,Lists!A24:E92,3,FALSE)","v":-34.439},null,null,null,null,null,null,null,null,null,null,null,null,null,null,"Soil water holding capacity (RAW) (mm):",{"$f":"(VLOOKUP(S6,Lists!A110:B116,2,FALSE)*S7)","v":66.55}]
[null,"Longitude",{"$f":"VLOOKUP(C6,Lists!A24:E92,4,FALSE)","v":140.59780000000001},null,null,null,null,null,null,"Effective rainfall from budburst (mm):",{"$f":"(IF(K16>0.00001,K16,K15)+IF(L16>0.00001,L16,L15)+IF(L16>0.00001,L16,L15)+IF(M16>0.00001,M16,M15)+IF(N16>0.00001,N16,N15)+IF(O16>0.00001,O16,O15)+IF(P16>0.00001,P16,P15)+IF(Q16>0.00001,Q16,Q15)+IF(R16>0.00001,R16,R15)+IF(S16>0.00001,S16,S15)+IF(T16>0.00001,T16,T15))*0.65","v":204.1},null,null,null,null,null,null,"Water stored in soil at budburst (mm):",40]
[null,null,null,null,null,null,null,null,null,"Percent of rainfall that is effective:",{"$f":"IF(VLOOKUP($C$6,Lists!$A$24:$F$92,6)=\"Full\",0.65,0.85)","v":0.65}]
[null,null,null,null,null,null,null,null,null,"Budburst:","September",null,null,null,null,null,null,"mm or ML/ha:","ML/ha"]
[]
[null,null,null,null,null,null,null,null,"Jul","Aug","Sep","Oct","Nov","Dec","Jan","Feb","Mar","Apr","May","Jun"]
[null,null,null,null,null,null,null,"Long Term Avg Rainfall (mm):",{"$f":"VLOOKUP(C6,'Monthly rain'!A:M,2,FALSE)","v":24.148387096774229},{"$f":"VLOOKUP(C6,'Monthly rain'!A:M,3,FALSE)","v":23.661290322580655},{"$f":"VLOOKUP(C6,'Monthly rain'!A:M,4,FALSE)","v":28.41612903225808},{"$f":"VLOOKUP(C6,'Monthly rain'!A:M,5,FALSE)","v":21.712903225806446},{"$f":"VLOOKUP(C6,'Monthly rain'!A:M,6,FALSE)","v":23.538709677419323},{"$f":"VLOOKUP(C6,'Monthly rain'!A:M,7,FALSE)","v":23.887096774193548},{"$f":"VLOOKUP(C6,'Monthly rain'!A:M,8,FALSE)","v":19.340624999999999},{"$f":"VLOOKUP(C6,'Monthly rain'!A:M,9,FALSE)","v":19.471731843575427},{"$f":"VLOOKUP(C6,'Monthly rain'!A:M,10,FALSE)","v":12.177419354838703},{"$f":"VLOOKUP(C6,'Monthly rain'!A:M,11,FALSE)","v":17.964516129032255},{"$f":"VLOOKUP(C6,'Monthly rain'!A:M,12,FALSE)","v":21.716129032258063},{"$f":"VLOOKUP(C6,'Monthly rain'!A:M,13,FALSE)","v":24.16451612903229}]
[null,null,null,null,null,null,null,"Expected Rainfall (mm):",35,33,9,77,44,55,66,4,22,null,null,99]
{"$rows_left_out":14}
{"sheet":"Edit Vineyard","index":2,"n_rows":18,"n_cols":10,"rows_kept":18,"cut":false,"hidden":true,"merged":[[17,7,17,8],[17,9,17,11],[15,1,15,3],[10,7,10,8],[10,9,10,11],[12,7,12,8],[12,9,12,11],[14,7,14,8],[14,9,14,11],[16,2,16,3],[17,2,17,3],[17,4,17,6],[10,4,10,6],[10,2,10,3],[12,1,12,3],[5,9,5,11],[7,7,7,8],[7,9,7,11],[9,7,9,8],[16,7,16,8],[3,5,3,8],[13,4,13,6],[13,2,13,3],[5,4,5,6],[15,4,15,6],[5,2,5,3],[9,2,9,3],[5,7,5,8]]}
[]
[]
[]
[null,null,null,null,null,"Edit Vineyard "]
[]
[null,null,"Season:",null,"2020-21",null,null,"Property Name:",null,"AWRI Vineyard"]
[]
[null,null,null,null,null,null,null,"Location:",null,"Riverland"]
[]
[null,null,"Water available at",null,null,null,null,"Irrigation Application"]
[null,null,"start of season (ML):",null,50,null,null,"Efficiency:",null,0.8]
[]
[null,"Additional water purchases",null,null,null,null,null,"Soil Type:",null,"Loamy sand"]
[null,null,"or dam inflows (ML):",null,10]
[null,null,null,1,null,null,null,"Rooting Depth:",null,1.21]
{"$rows_left_out":4}
{"sheet":"Edit Block","index":3,"n_rows":101,"n_cols":26,"rows_kept":101,"cut":false,"hidden":true,"merged":[[16,1,16,2],[16,3,16,5],[3,1,3,6],[5,1,5,2],[5,3,5,5],[7,1,7,2],[7,3,7,5],[9,1,9,2],[10,6,14,6],[13,4,13,5],[14,1,14,2],[14,3,14,5],[10,1,10,2],[10,3,10,5],[12,1,12,2],[12,3,12,5]]}
[]
[]
[]
[null,"Edit Block "]
[]
[null,"Block Name:",null,"SHI Bin28"]
[]
[null,"Variety Class:",null,"Red"]
[]
[null,"Maximum Soil"]
[null,"RAW:",null,55]
[]
[null,"Full / Supplementary:",null,"Full"]
[]
[null,"Area (Ha):",null,1]
{"$rows_left_out":87}
{"sheet":"Add Block","index":4,"n_rows":17,"n_cols":2,"rows_kept":17,"cut":false,"hidden":true,"merged":[[12,3,12,5],[16,1,16,2],[16,3,16,5],[3,1,3,6],[5,1,5,2],[5,3,5,5],[7,1,7,2],[7,3,7,5],[9,1,9,2],[10,6,14,6],[13,4,13,5],[10,1,10,2],[10,3,10,5],[14,1,14,2],[14,3,14,5],[12,1,12,2]]}
[]
[]
[]
[null,"Add Block"]
[]
[null,"Block Name:"]
[]
[null,"Variety Class:"]
[]
[null,"Maximum Soil"]
[null,"RAW:"]
[]
[null,"Full / Supplementary:"]
[]
[null,"Area (Ha):"]
{"$rows_left_out":3}
{"sheet":"Lists","index":5,"n_rows":157,"n_cols":6,"rows_kept":157,"cut":false,"hidden":true,"merged":[]}
["Crop Type"]
["Red"]
["White"]
[]
[]
[]
["Target Percentage"]
[1,1]
[0.9,0.8]
[0.75,0.65]
[0.5,0.55000000000000004]
[0.1,0.4]
[]
["Budburst"]
["August"]
{"$rows_left_out":143}
{"sheet":"Crop Co-efficient","index":6,"n_rows":3,"n_cols":13,"rows_kept":3,"cut":false,"hidden":true,"merged":[]}
["MONTH","JUL","AUG","SEP","OCT","NOV","DEC","JAN","FEB","MAR","APR","MAY","JUN"]
["WINEGRAPE (full)",0.05,0.1,0.3,0.4,0.5,0.7,0.7,0.7,0.7,0.45,0.24,0.05]
["WINEGRAPE (supplementary)",0.05,0.05,0.05,0.28000000000000003,0.35,0.42,0.42,0.43,0.43,0.15,0.24,0.05]

{"sheet":"Monthly rain","index":7,"n_rows":70,"n_cols":13,"rows_kept":70,"cut":false,"hidden":true,"merged":[]}
["Geographical Indication:","Jul","Aug","Sep","Oct","Nov","Dec","Jan","Feb","Mar","Apr","May","Jun"]
["Adelaide Hills - Lenswood",163.2741935483869,145.96129032258062,115.01612903225805,71.729032258064521,46.503225806451596,44.445161290322595,28.453125000000011,26.839329608938563,33.683870967741967,58.029032258064518,106.54838709677422,146.91612903225794]
["Adelaide Hills - Stirling",151.01612903225799,135.26129032258038,112.49354838709661,72.970967741935397,53.596774193548399,48.212903225806464,33.675000000000004,30.940155728587346,42.651612903225796,65.267741935483855,114.96451612903203,147.80322580645156]
["Adelaide Plains",52.032258064516235,49.232258064516195,46.832258064516218,31.751612903225848,24.919354838709683,27.325806451612927,20.3,19.118212290502797,20.967741935483883,26.203225806451623,42.225806451612925,55.703225806451726]
["Albany",114.69677419354839,111.41935483870962,93.164516129032194,64.490322580645227,43.990322580645113,32.261290322580663,24.559375000000006,22.199776536312868,39.051612903225823,59.506451612903312,72.858064516129048,104.90645161290317]
["Alpine Valleys",108.06129032258026,107.12258064516109,82.722580645161031,77.009677419354702,68.932258064516148,70.122580645161264,55.515624999999964,56.043798882681514,55.199999999999967,54.032258064516022,80.187096774193279,97.864516129031756]
["Barossa Valley",62.751612903225919,61.470967741935532,58.780645161290344,36.267741935483897,32.28064516129033,32.267741935483883,17.67499999999999,21.62100558659218,23.970967741935478,30.506451612903238,43.81612903225809,59.68064516129045]
["Beechworth",121.84838709677398,115.55161290322543,93.067741935483809,80.145161290322633,80.503225806451681,77.683870967741967,59.837500000000063,58.002234636871556,56.745161290322663,59.529032258064596,88.099999999999952,109.67096774193496]
["Bendigo",56.006451612903433,53.983870967742099,50.387096774193665,39.383870967742013,43.903225806451609,38.448387096774248,33.134375000000027,29.370279329608945,28.83870967741937,33.096774193548406,45.061290322580781,55.358064516129303]
["Blackwood Valley",138.32903225806407,118.48709677419328,88.761290322580635,45.200000000000031,31.161290322580669,20.383870967741956,15.346874999999994,14.112625698324011,22.954838709677436,45.70967741935489,99.487096774193191,110.91612903225763]
["Canberra",40.206451612903251,41.703225806451641,52.677419354838754,46.058064516129051,67.380645161290332,61.151612903225811,56.150000000000027,57.511061452513985,50.612903225806434,36.809677419354863,31.638709677419413,48.164516129032357]
["Clare",71.474193548387191,69.861290322580729,63.770967741935586,45.383870967741991,37.770967741935522,38.403225806451637,24.125000000000004,24.092513966480439,25.212903225806478,35.629032258064555,52.929032258064595,74.690322580645187]
["Coonawarra",80.858064516128991,83.016129032257979,63.709677419354861,42.425806451612985,36.603225806451682,32.645161290322598,27.890625000000032,17.957541899441335,26.535483870967788,37.022580645161334,54.022580645161369,72.964516129032262]
["Cowra",53.306451612903246,47.109677419354853,50.938709677419382,49.961290322580631,55.770967741935458,64.977419354838744,47.434374999999974,59.203575418994376,50.058064516129015,38.687096774193549,40.183870967741953,52.335483870967764]
["Currency Creek",65.906451612903197,59.622580645161221,51.393548387096715,35.20322580645167,27.525806451612929,28.625806451612938,16.775000000000002,18.207786429365967,18.138709677419374,30.603225806451665,51.138709677419307,69.041935483870873]
{"$rows_left_out":56}
{"sheet":"Monthly Et Short crop","index":8,"n_rows":70,"n_cols":13,"rows_kept":70,"cut":false,"hidden":true,"merged":[]}
["Geographical Indication:","Jul","Aug","Sep","Oct","Nov","Dec","Jan","Feb","Mar","Apr","May","Jun"]
["Adelaide Hills - Lenswood",34.364516129032232,50.04193548387093,75.22580645161284,112.1483870967742,137.93548387096777,160.80967741935461,173.49375000000006,141.58927374301678,120.39354838709671,77.758064516129082,47.077419354838639,30.954838709677411]
["Adelaide Hills - Stirling",29.319354838709693,44.116129032258051,67.338709677419274,101.78709677419343,124.68709677419349,145.85483870967724,157.74375000000015,129.03359288097886,108.80967741935487,69.903225806451687,41.158064516129024,26.306451612903214]
["Adelaide Plains",39.832258064516125,55.722580645161258,83.232258064516103,128.48709677419376,158.38709677419357,181.43225806451576,195.03437499999993,160.78569832402229,137.60645161290324,92.732258064516088,57.274193548387075,36.861290322580707]
["Albany",40.854838709677445,53.293548387096827,71.419354838709651,96.254838709677344,117.55806451612898,139.68064516129036,143.87812500000004,118.410279329609,104.25161290322582,71.932258064516219,50.125806451612867,37.625806451612938]
["Alpine Valleys",31.174193548387112,46.135483870967789,69.932258064516134,109.67096774193553,139.11612903225796,172.21935483870968,184.83437500000008,147.66793296089401,125.99032258064503,75.803225806451508,44.041935483870958,29.51935483870966]
["Barossa Valley",36.741935483870989,51.68387096774191,78.509677419354944,121.94516129032267,150.57419354838703,175.79677419354869,189.09062500000005,155.15441340782118,130.87741935483885,84.700000000000074,51.116129032258094,33.229032258064528]
["Beechworth",26.535483870967781,40.709677419354826,64.003225806451638,103.82903225806437,133.24838709677414,166.31612903225832,179.03749999999994,142.32759776536341,120.14516129032249,70.674193548387095,39.883870967741998,25.987096774193546]
["Bendigo",30.383870967741913,46.45483870967746,72.170967741935414,115.74838709677424,145.9806451612904,177.2161290322581,187.96874999999983,152.41698324022349,128.55806451612895,78.377419354838707,44.254838709677372,28.467741935483854]
["Blackwood Valley",36.745161290322564,48.361290322580587,65.867741935483863,99.225806451612925,135.05161290322599,169.69032258064505,180.00937500000006,148.12782122905065,125.37096774193547,77.280645161290394,48.993548387096759,35.322580645161295]
["Canberra",36.92903225806451,54.674193548387095,79.577419354838696,115.2838709677419,138.01612903225802,167.02258064516121,172.5781249999998,134.19351955307238,116.12903225806444,76.003225806451525,49.574193548387136,33.30322580645165]
["Clare",35.706451612903173,51.406451612903211,78.051612903225745,121.2677419354838,151.04193548387084,178.29032258064501,192.17187499999983,157.97944134078222,134.65806451612909,86.696774193548464,50.948387096774177,32.248387096774223]
["Coonawarra",32.158064516128938,45.370967741935523,65.338709677419388,100.46774193548387,123.31290322580637,150.72580645161281,163.60625000000024,133.32692737430145,110.69032258064517,68.390322580645133,41.083870967741909,28.474193548387095]
["Cowra",38.687096774193513,56.148387096774186,83.758064516128954,125.11612903225814,154.20645161290301,186.43548387096794,195.25312499999995,154.03128491620129,134.08387096774192,88.399999999999892,55.129032258064477,35.69032258064513]
["Currency Creek",40.280645161290238,56.419354838709651,79.300000000000011,114.30645161290305,134.08387096774189,151.67096774193541,158.44374999999997,127.9279199110122,112.47419354838706,77.206451612903223,51.125806451612924,36.580645161290299]
{"$rows_left_out":56}
{"sheet":"Main Menu","index":9,"n_rows":5,"n_cols":13,"rows_kept":5,"cut":false,"hidden":true,"merged":[[3,7,3,8],[3,10,3,11],[4,7,4,8],[19,1,19,2],[20,1,20,2],[19,3,19,6],[20,3,20,6],[2,1,5,3],[2,4,5,6]]}
[]
[]
[null,null,null,null,"Vineyard Irrigation Budgeting Tool"]
[null,null,null,null,null,null,null,"Current Season:",null,null,null,null,"mm"]
[null,null,null,null,null,null,null,"Water Allocation:",null,41.06,"Unallocated:","53:94","ML/ha"]